Reaction Details
TargetP2X purinoceptor 7
LigandBDBM242050
Substrate/Competitorn/a
Meas. Tech.Fluorescent Imaging Plate Reader (FLIPR) Assay
pH7.4±n/a
Temperature310.15±n/a K
IC50 3.5±n/a nM
Commentsextracted
Citation Kilburn, JPRasmussen, LKJessing, MEldemenky, EMChen, BJiang, Y Cyclic amines US Patent US9415055 Publication Date 8/16/2016
 
P2X purinoceptor 7
Name:P2X purinoceptor 7
Type:Protein
Mol. Mass.:68602.85
Organism:Homo sapiens (Human)
Description:Q99572
Residue:595
BDBM242050
NameBDBM242050
Synonyms:US9415055, (-)2-chloro-3-methoxy-N-(2-morpholino-2-(6-(trifluoromethyl)pyridin-3-yl)ethyl)benzamide | US9593105, 52
TypeSmall organic molecule
Emp. Form.C20H21ClF3N3O3
Mol. Mass.443.847
SMILESCOc1cccc(C(=O)NCC(N2CCOCC2)c2ccc(nc2)C(F)(F)F)c1Cl