Reaction Details
TargetP2X purinoceptor 7
LigandBDBM242078
Substrate/Competitorn/a
Meas. Tech.Fluorescent Imaging Plate Reader (FLIPR) Assay
pH7.4±n/a
Temperature310.15±n/a K
IC50 1.7±n/a nM
Commentsextracted
Citation Kilburn, JPRasmussen, LKJessing, MEldemenky, EMChen, BJiang, Y Cyclic amines US Patent US9415055 Publication Date 8/16/2016
 
P2X purinoceptor 7
Name:P2X purinoceptor 7
Type:Protein
Mol. Mass.:68602.85
Organism:Homo sapiens (Human)
Description:Q99572
Residue:595
BDBM242078
NameBDBM242078
Synonyms:US9415055, (+)2-chloro-N-[2-(4,4-difluoro-1-piperidyl)-2-[6-(trifluoromethyl)-3-pyridyl]ethyl]-3-fluoro-benzamide | US9593105, 80
TypeSmall organic molecule
Emp. Form.C20H18ClF6N3O
Mol. Mass.465.82
SMILESFc1cccc(C(=O)NCC(N2CCC(F)(F)CC2)c2ccc(nc2)C(F)(F)F)c1Cl