Reaction Details
TargetP2X purinoceptor 7
LigandBDBM242107
Substrate/Competitorn/a
Meas. Tech.Fluorescent Imaging Plate Reader (FLIPR) Assay
pH7.4±n/a
Temperature310.15±n/a K
IC50 2.6±n/a nM
Commentsextracted
Citation Kilburn, JPRasmussen, LKJessing, MEldemenky, EMChen, BJiang, Y Cyclic amines US Patent US9415055 Publication Date 8/16/2016
 
P2X purinoceptor 7
Name:P2X purinoceptor 7
Type:Protein
Mol. Mass.:68602.85
Organism:Homo sapiens (Human)
Description:Q99572
Residue:595
BDBM242107
NameBDBM242107
Synonyms:US9415055, (+)2-chloro-N-[2-(4,4-difluoro-1-piperidyl)-2-(4-fluorophenyl)ethyl]-3-methoxy-benzamide
TypeSmall organic molecule
Emp. Form.C21H22ClF3N2O2
Mol. Mass.426.86
SMILESCOc1cccc(C(=O)NCC(N2CCC(F)(F)CC2)c2ccc(F)cc2)c1Cl