Reaction Details
TargetP2X purinoceptor 7
LigandBDBM242110
Substrate/Competitorn/a
Meas. Tech.Fluorescent Imaging Plate Reader (FLIPR) Assay
pH7.4±n/a
Temperature310.15±n/a K
IC50 1.5±n/a nM
Commentsextracted
Citation Kilburn, JPRasmussen, LKJessing, MEldemenky, EMChen, BJiang, Y Cyclic amines US Patent US9415055 Publication Date 8/16/2016
 
P2X purinoceptor 7
Name:P2X purinoceptor 7
Type:Protein
Mol. Mass.:68602.85
Organism:Homo sapiens (Human)
Description:Q99572
Residue:595
BDBM242110
NameBDBM242110
Synonyms:US9415055, (-)2-chloro-N-[2-(4-chlorophenyl)-2-morpholino-ethyl]-3-methoxy-benzamide | US9593105, 112
TypeSmall organic molecule
Emp. Form.C20H22Cl2N2O3
Mol. Mass.409.306
SMILESCOc1cccc(C(=O)NCC(N2CCOCC2)c2ccc(Cl)cc2)c1Cl