Reaction Details
TargetP2X purinoceptor 7
LigandBDBM242123
Substrate/Competitorn/a
Meas. Tech.Fluorescent Imaging Plate Reader (FLIPR) Assay
pH7.4±n/a
Temperature310.15±n/a K
IC50 3.5±n/a nM
Commentsextracted
Citation Kilburn, JPRasmussen, LKJessing, MEldemenky, EMChen, BJiang, Y Cyclic amines US Patent US9415055 Publication Date 8/16/2016
 
P2X purinoceptor 7
Name:P2X purinoceptor 7
Type:Protein
Mol. Mass.:68602.85
Organism:Homo sapiens (Human)
Description:Q99572
Residue:595
BDBM242123
NameBDBM242123
Synonyms:US9415055, (+)2,3-dichloro-N-[2-(4-fluoro-1-piperidyl)-2-[2-(trifluoromethyl)pyrimidin-5-yl]ethyl]benzamide | US9593105, 125
TypeSmall organic molecule
Emp. Form.C19H18Cl2F4N4O
Mol. Mass.465.272
SMILESFC1CCN(CC1)C(CNC(=O)c1cccc(Cl)c1Cl)c1cnc(nc1)C(F)(F)F