Reaction Details
TargetP2X purinoceptor 7
LigandBDBM242163
Substrate/Competitorn/a
Meas. Tech.Fluorescent Imaging Plate Reader (FLIPR) Assay
pH7.4±n/a
Temperature310.15±n/a K
IC50 3.2±n/a nM
Commentsextracted
Citation Kilburn, JPRasmussen, LKJessing, MEldemenky, EMChen, BJiang, Y Cyclic amines US Patent US9415055 Publication Date 8/16/2016
 
P2X purinoceptor 7
Name:P2X purinoceptor 7
Type:Protein
Mol. Mass.:68602.85
Organism:Homo sapiens (Human)
Description:Q99572
Residue:595
BDBM242163
NameBDBM242163
Synonyms:US9415055, (+)2,3-dichloro-N-[2-(4,4-difluoro-1-piperidyl)-2-(2-methylpyrimidin-5-yl)ethyl]benzamide
TypeSmall organic molecule
Emp. Form.C19H20Cl2F2N4O
Mol. Mass.429.291
SMILESCc1ncc(cn1)C(CNC(=O)c1cccc(Cl)c1Cl)N1CCC(F)(F)CC1