Reaction Details
TargetBeta-secretase 2
LigandBDBM242266
Substrate/Competitorn/a
Meas. Tech.HTRF FRET Assay
pH5±n/a
Temperature303.15±n/a K
Ki 0.24±n/a nM
Commentsextracted
Citation Gilbert, EJCumming, JNStamford, AWYu, YScott, JDIserloh, UWang, LCaldwell, JP Tricyclic substituted thiadiazine dioxide compounds as BACE inhibitors, compositions and their use US Patent US9416129 Publication Date 8/16/2016
 
Beta-secretase 2
Name:Beta-secretase 2
Type:Protein
Mol. Mass.:56171.20
Organism:Homo sapiens (Human)
Description:Q9Y5Z0
Residue:518
BDBM242266
NameBDBM242266
Synonyms:US9416129, 44
TypeSmall organic molecule
Emp. Form.C20H20ClN5O3S2
Mol. Mass.477.987
SMILESCN1C(=N)N[C@@](C)(CS1(=O)=O)c1sc(cc1Cl)-c1cccc(c1)-c1noc(n1)C1CC1