Reaction Details
TargetBeta-secretase 2
LigandBDBM242268
Substrate/Competitorn/a
Meas. Tech.HTRF FRET Assay
pH5±n/a
Temperature303.15±n/a K
Ki 0.41±n/a nM
Commentsextracted
Citation Gilbert, EJCumming, JNStamford, AWYu, YScott, JDIserloh, UWang, LCaldwell, JP Tricyclic substituted thiadiazine dioxide compounds as BACE inhibitors, compositions and their use US Patent US9416129 Publication Date 8/16/2016
 
Beta-secretase 2
Name:Beta-secretase 2
Type:Protein
Mol. Mass.:56171.20
Organism:Homo sapiens (Human)
Description:Q9Y5Z0
Residue:518
BDBM242268
NameBDBM242268
Synonyms:US9416129, 46
TypeSmall organic molecule
Emp. Form.C17H16ClN5O3S2
Mol. Mass.437.924
SMILESCN1C(=N)N[C@@](C)(CS1(=O)=O)c1sc(cc1Cl)-c1cccc(c1)-c1ncon1