Reaction Details
TargetTyrosine-protein phosphatase non-receptor type 1 [1-321]
LigandBDBM50146462
Substrate/Competitorn/a
Meas. Tech.PTP1B Activity Assay
pH7.5±0
Temperature310.15±0 K
IC50 1.3774e+5± 1.320e+4 nM
Citation Adisakwattana, SPongsuwan, JWungcharoen, CYibchok-anun, S In vitro effects of cinnamic acid derivatives on protein tyrosine phosphatase 1B. J Enzyme Inhib Med Chem28:1067-72 (2013) 
 
Tyrosine-protein phosphatase non-receptor type 1 [1-321]
Name:Tyrosine-protein phosphatase non-receptor type 1 [1-321]
Type:Enzyme
Mol. Mass.:37311.71
Organism:Homo sapiens (Human)
Description:P18031 (1-321 aa)
Residue:321
BDBM50146462
NameBDBM50146462
Synonyms:(2E)-3-(2-hydroxyphenyl)-2-propenoic acid (2E)-3-(2-hydroxyphenyl)prop-2-enoic acid (7) (E)-3-(2-hydroxyphenyl)-2-propenoic acid CHEMBL52564 o-hydroxy-trans-cinnamic acid trans-o-hydroxycinnamic acid
TypeSmall organic molecule
Emp. Form.C9H8O3
Mol. Mass.164.158
SMILESOC(=O)\C=C\c1ccccc1O