Reaction Details
TargetP2Y purinoceptor 1
LigandBDBM50017021
Substrate/Competitorn/a
Meas. Tech.Binding Assay
Temperature298.15±n/a K
Ki 10.3±n/a nM
Commentsextracted
Citation Thibeault, CClark, CGDeLucca, IHu, CHJeon, YLam, PYQiao, JXYang, WWang, YWang, TC 7-hydroxy-spiropipiperidine indolinyl antagonists of P2Y1 receptor US Patent US9428504 Publication Date 8/30/2016
 
P2Y purinoceptor 1
Name:P2Y purinoceptor 1
Type:Enzyme
Mol. Mass.:42090.25
Organism:Homo sapiens (Human)
Description:P47900
Residue:373
BDBM50017021
NameBDBM50017021
Synonyms:CHEMBL3287047 | US9428504, 1
TypeSmall organic molecule
Emp. Form.C31H35F3N4O3
Mol. Mass.568.6298
SMILESCC(C)(C)CN1CCC2(CN(c3c2cccc3O)c2ccccc2NC(=O)Nc2ccc(OC(F)(F)F)cc2)CC1