Reaction Details
TargetP2Y purinoceptor 1
LigandBDBM50017091
Substrate/Competitorn/a
Meas. Tech.Scintillation Proximity Assay (SPA)
pH7.4±n/a
Temperature298.15±n/a K
Ki 4.4±n/a nM
Commentsextracted
Citation Thibeault, CClark, CGDeLucca, IHu, CHJeon, YLam, PYQiao, JXYang, WWang, YWang, TC 7-hydroxy-spiropipiperidine indolinyl antagonists of P2Y1 receptor US Patent US9428504 Publication Date 8/30/2016
 
P2Y purinoceptor 1
Name:P2Y purinoceptor 1
Type:Enzyme
Mol. Mass.:42090.25
Organism:Homo sapiens (Human)
Description:P47900
Residue:373
BDBM50017091
NameBDBM50017091
Synonyms:CHEMBL3287045 | US9428504, 6
TypeSmall organic molecule
Emp. Form.C31H34F4N4O3
Mol. Mass.586.6203
SMILESCC(C)(C)CN1CCC2(CN(c3c2c(F)ccc3O)c2ccccc2NC(=O)Nc2ccc(OC(F)(F)F)cc2)CC1