Reaction Details
TargetP2Y purinoceptor 1
LigandBDBM245275
Substrate/Competitorn/a
Meas. Tech.Binding Assay
Temperature298.15±n/a K
Ki 3.3±n/a nM
Commentsextracted
Citation Thibeault, CClark, CGDeLucca, IHu, CHJeon, YLam, PYQiao, JXYang, WWang, YWang, TC 7-hydroxy-spiropipiperidine indolinyl antagonists of P2Y1 receptor US Patent US9428504 Publication Date 8/30/2016
 
P2Y purinoceptor 1
Name:P2Y purinoceptor 1
Type:Enzyme
Mol. Mass.:42090.25
Organism:Homo sapiens (Human)
Description:P47900
Residue:373
BDBM245275
NameBDBM245275
Synonyms:US9428504, 13
TypeSmall organic molecule
Emp. Form.C34H42F3N5O2
Mol. Mass.609.7248
SMILESCC(C)(C)CN1CCC2(CN(c3c2c(ccc3O)C(F)(F)F)c2ncccc2NC(=O)Nc2ccc(cc2)C(C)(C)C)CC1