Reaction Details
TargetP2Y purinoceptor 1
LigandBDBM245284
Substrate/Competitorn/a
Meas. Tech.Scintillation Proximity Assay (SPA)
pH7.4±n/a
Temperature298.15±n/a K
Ki 4.4±n/a nM
Commentsextracted
Citation Thibeault, CClark, CGDeLucca, IHu, CHJeon, YLam, PYQiao, JXYang, WWang, YWang, TC 7-hydroxy-spiropipiperidine indolinyl antagonists of P2Y1 receptor US Patent US9428504 Publication Date 8/30/2016
 
P2Y purinoceptor 1
Name:P2Y purinoceptor 1
Type:Enzyme
Mol. Mass.:42090.25
Organism:Homo sapiens (Human)
Description:P47900
Residue:373
BDBM245284
NameBDBM245284
Synonyms:US9428504, 22
TypeSmall organic molecule
Emp. Form.C32H34F6N4O2
Mol. Mass.620.6284
SMILESCC(C)(C)CN1CCC2(CN(c3c2c(ccc3O)C(F)(F)F)c2ccccc2NC(=O)Nc2ccc(cc2)C(F)(F)F)CC1