Reaction Details
TargetP2Y purinoceptor 1
LigandBDBM245309
Substrate/Competitorn/a
Meas. Tech.Scintillation Proximity Assay (SPA)
pH7.4±n/a
Temperature298.15±n/a K
Ki 6.5±n/a nM
Commentsextracted
Citation Thibeault, CClark, CGDeLucca, IHu, CHJeon, YLam, PYQiao, JXYang, WWang, YWang, TC 7-hydroxy-spiropipiperidine indolinyl antagonists of P2Y1 receptor US Patent US9428504 Publication Date 8/30/2016
 
P2Y purinoceptor 1
Name:P2Y purinoceptor 1
Type:Enzyme
Mol. Mass.:42090.25
Organism:Homo sapiens (Human)
Description:P47900
Residue:373
BDBM245309
NameBDBM245309
Synonyms:US9428504, 49
TypeSmall organic molecule
Emp. Form.C30H36ClN5O2S2
Mol. Mass.598.222
SMILESCC(C)(C)CN1CCC2(CN(c3c2c(Cl)ccc3O)c2ccccc2NC(=O)Nc2nc3CCSCc3s2)CC1