Reaction Details
TargetP2Y purinoceptor 1
LigandBDBM245310
Substrate/Competitorn/a
Meas. Tech.Scintillation Proximity Assay (SPA)
pH7.4±n/a
Temperature298.15±n/a K
Ki 6.8±n/a nM
Commentsextracted
Citation Thibeault, CClark, CGDeLucca, IHu, CHJeon, YLam, PYQiao, JXYang, WWang, YWang, TC 7-hydroxy-spiropipiperidine indolinyl antagonists of P2Y1 receptor US Patent US9428504 Publication Date 8/30/2016
 
P2Y purinoceptor 1
Name:P2Y purinoceptor 1
Type:Enzyme
Mol. Mass.:42090.25
Organism:Homo sapiens (Human)
Description:P47900
Residue:373
BDBM245310
NameBDBM245310
Synonyms:US9428504, 50
TypeSmall organic molecule
Emp. Form.C27H33ClN6O3S
Mol. Mass.557.107
SMILESCOc1nsc(NC(=O)Nc2ccccc2N2CC3(CCN(CC(C)(C)C)CC3)c3c2c(O)ccc3Cl)n1