Reaction Details
TargetP2Y purinoceptor 1
LigandBDBM50045605
Substrate/Competitorn/a
Meas. Tech.Scintillation Proximity Assay (SPA)
pH7.4±n/a
Temperature298.15±n/a K
Ki 12.3±n/a nM
Commentsextracted
Citation Thibeault, CClark, CGDeLucca, IHu, CHJeon, YLam, PYQiao, JXYang, WWang, YWang, TC 7-hydroxy-spiropipiperidine indolinyl antagonists of P2Y1 receptor US Patent US9428504 Publication Date 8/30/2016
 
P2Y purinoceptor 1
Name:P2Y purinoceptor 1
Type:Enzyme
Mol. Mass.:42090.25
Organism:Homo sapiens (Human)
Description:P47900
Residue:373
BDBM50045605
NameBDBM50045605
Synonyms:CHEMBL3314319 | US9428504, 157
TypeSmall organic molecule
Emp. Form.C37H37ClF4N4O3
Mol. Mass.697.161
SMILESCC(C)(C)CN1CCC2(CN(c3c2c(c(F)cc3O)-c2ccc(Cl)cc2)c2ccccc2NC(=O)Nc2ccc(OC(F)(F)F)cc2)CC1