Reaction Details
TargetFatty acid synthase
LigandBDBM244437
Substrate/Competitorn/a
Meas. Tech.Biochemical Assay
Temperature277.15±n/a K
IC50 5±n/a nM
Commentsextracted
Citation Oslob, JDMcDowell, RSJohnson, RYang, HEvanchik, MZaharia, CACai, HHu, LWWagman, AS Heterocyclic modulators of lipid synthesis US Patent US9428502 Publication Date 8/30/2016
 
Fatty acid synthase
Name:Fatty acid synthase
Type:Enzyme
Mol. Mass.:273419.37
Organism:Homo sapiens (Human)
Description:P49327
Residue:2511
BDBM244437
NameBDBM244437
Synonyms:US10226449, cpd 46 | US9428502, 46
TypeSmall organic molecule
Emp. Form.C24H23ClN4O
Mol. Mass.418.919
SMILESCc1nc(Cl)c([nH]1)-c1cc(ccc1C)C(=O)N1CCC(CC1)c1ccc(cc1)C#N