Reaction Details
TargetFatty acid synthase
LigandBDBM244581
Substrate/Competitorn/a
Meas. Tech.Biochemical Assay
Temperature277.15±n/a K
IC50 8±n/a nM
Commentsextracted
Citation Oslob, JDMcDowell, RSJohnson, RYang, HEvanchik, MZaharia, CACai, HHu, LWWagman, AS Heterocyclic modulators of lipid synthesis US Patent US9428502 Publication Date 8/30/2016
 
Fatty acid synthase
Name:Fatty acid synthase
Type:Enzyme
Mol. Mass.:273419.37
Organism:Homo sapiens (Human)
Description:P49327
Residue:2511
BDBM244581
NameBDBM244581
Synonyms:US10226449, cpd 190 | US9428502, 190
TypeSmall organic molecule
Emp. Form.C27H27N5O3
Mol. Mass.469.535
SMILESCOC(=O)N1CC(C1)c1nc(C)c([nH]1)-c1cc(ccc1C)C(=O)N1CC(C1)c1ccc(cc1)C#N