Reaction Details
TargetParathyroid hormone/parathyroid hormone-related peptide receptor
LigandBDBM64566
Substrate/Competitorn/a
Meas. Tech.cAMP Assay
pH7.4±n/a
EC50 12000±n/a nM
Commentsextracted
Citation Nishimura, YEsaki, TTamura, T Hydantoin derivative US Patent US9428505 Publication Date 8/30/2016
 
Parathyroid hormone/parathyroid hormone-related peptide receptor
Name:Parathyroid hormone/parathyroid hormone-related peptide receptor
Type:Enzyme
Mol. Mass.:66273.93
Organism:Rattus norvegicus (Rat)
Description:P25961
Residue:591
BDBM64566
NameBDBM64566
Synonyms:US9428505, Compound 10
Typen/a
Emp. Form.C29H30F3N5O7S
Mol. Mass.649.638
SMILESCc1cc(cc(C)c1CCS(=O)(=O)N1CCC2(CC1)N=C(NC2=O)c1ccc(OC(F)(F)F)cc1)N1C(=O)NC(=O)C11COC1