Reaction Details
TargetHistone-lysine N-methyltransferase, H3 lysine-79 specific [1-416]
LigandBDBM244798
Substrate/Competitorn/a
Meas. Tech.In Vitro Biological Assay
IC50 2.92±n/a nM
Citation Klaus, CRaimondi, MADaigle, SRPollock, RM Combination therapy for treating cancer US Patent US9446064 Publication Date 9/20/2016
 
Histone-lysine N-methyltransferase, H3 lysine-79 specific [1-416]
Name:Histone-lysine N-methyltransferase, H3 lysine-79 specific [1-416]
Type:Protein
Mol. Mass.:47443.16
Organism:Homo sapiens (Human)
Description:Q8TEK3 aa 1-416
Residue:416
BDBM244798
NameBDBM244798
Synonyms:US9446064, A93
TypeSmall organic molecule
Emp. Form.C27H32F3N8O4
Mol. Mass.589.5894
SMILESCC(C)N(C[C@H]1O[C@H]([C@H](O)[C@@H]1O)n1cnc2c(N)ncnc12)[C@H]1C[C@H](CCc2nc3ccc(OC(F)(F)F)cc3n2)C1