Reaction Details
TargetDual specificity tyrosine-phosphorylation-regulated kinase 1A
LigandBDBM50434358
Substrate/Competitorn/a
Meas. Tech.HotSpot Technology Assay
pH7.5±n/a
Temperature298.15±n/a K
IC50 0.16±n/a nM
Commentsextracted
Citation Leblond, BCasagrande, ADesire, LFoucourt, ABesson, T DYRK1 inhibitors and uses thereof US Patent US9446044 Publication Date 9/20/2016
 
Dual specificity tyrosine-phosphorylation-regulated kinase 1A
Name:Dual specificity tyrosine-phosphorylation-regulated kinase 1A
Type:Enzyme
Mol. Mass.:85616.61
Organism:Homo sapiens (Human)
Description:Q13627
Residue:763
BDBM50434358
NameBDBM50434358
Synonyms:CHEMBL2386770 | US9446044, 68
TypeSmall organic molecule
Emp. Form.C17H11BrFN5OS
Mol. Mass.432.27
SMILESCOC(=N)c1nc2ccc3ncnc(Nc4ccc(F)cc4Br)c3c2s1