Reaction Details
TargetDual specificity tyrosine-phosphorylation-regulated kinase 1A
LigandBDBM246377
Substrate/Competitorn/a
Meas. Tech.HotSpot Technology Assay
pH7.5±n/a
Temperature298.15±n/a K
IC50 4.25±n/a nM
Commentsextracted
Citation Leblond, BCasagrande, ADesire, LFoucourt, ABesson, T DYRK1 inhibitors and uses thereof US Patent US9446044 Publication Date 9/20/2016
 
Dual specificity tyrosine-phosphorylation-regulated kinase 1A
Name:Dual specificity tyrosine-phosphorylation-regulated kinase 1A
Type:Enzyme
Mol. Mass.:85616.61
Organism:Homo sapiens (Human)
Description:Q13627
Residue:763
BDBM246377
NameBDBM246377
Synonyms:US9446044, 54
TypeSmall organic molecule
Emp. Form.C18H15N5O3S
Mol. Mass.381.408
SMILESCOC(=N)c1nc2ccc3ncnc(Nc4ccc(OC)c(O)c4)c3c2s1