Reaction Details
TargetDual specificity tyrosine-phosphorylation-regulated kinase 1B
LigandBDBM50434341
Substrate/Competitorn/a
Meas. Tech.HotSpot Technology Assay
pH7.5±n/a
Temperature298.15±n/a K
IC50 31.50±n/a nM
Commentsextracted
Citation Leblond, BCasagrande, ADesire, LFoucourt, ABesson, T DYRK1 inhibitors and uses thereof US Patent US9446044 Publication Date 9/20/2016
 
Dual specificity tyrosine-phosphorylation-regulated kinase 1B
Name:Dual specificity tyrosine-phosphorylation-regulated kinase 1B
Type:Enzyme
Mol. Mass.:69222.24
Organism:Homo sapiens (Human)
Description:Q9Y463
Residue:629
BDBM50434341
NameBDBM50434341
Synonyms:CHEMBL2386759 | US9446044, 86
TypeSmall organic molecule
Emp. Form.C16H9BrFN5OS
Mol. Mass.418.243
SMILESNC(=O)c1nc2ccc3ncnc(Nc4ccc(F)cc4Br)c3c2s1