Reaction Details
TargetUrease
LigandBDBM50229993
Substrate/Competitorn/a
Meas. Tech.Urease Inhibition Assay
pH6.8±0
Temperature303.15±0 K
IC50 2.10e+4± 1.4e+2 nM
Citation Adsul, LKBandgar, BPChavan, HVJalde, SSDhakane, VDShirfule, AL Synthesis and biological evaluation of novel series of aminopyrimidine derivatives as urease inhibitors and antimicrobial agents. J Enzyme Inhib Med Chem28:1316-23 (2013) 
 
Urease
Name:Urease
Type:Enzyme
Mol. Mass.:90746.20
Organism:Canavalia ensiformis (Jack bean) (Horse bean)
Description:P07374
Residue:840
BDBM50229993
NameBDBM50229993
Synonyms:2-thiourea Thiocarbamid Thiokarbamid thiocarbamide thiourea
TypeSmall organic molecule
Emp. Form.CH4N2S
Mol. Mass.76.121
SMILESNC(N)=S