Reaction Details
TargetPancreatic triacylglycerol lipase
LigandBDBM246492
Substrate/CompetitorBDBM246504
Meas. Tech.In Vitro Pancreatic Lipase Assay
pH7.4±0
Temperature310.15±0 K
Ki 9.66e+3± 4.5e+2 nM
IC50 4.570e+4± 2.14e+3 nM
Citation Yang, MHChin, YWYoon, KDKim, J Phenolic compounds with pancreatic lipase inhibitory activity from Korean yam (Dioscorea opposita). J Enzyme Inhib Med Chem29:1-6 (2014) 
 
Pancreatic triacylglycerol lipase
Name:Pancreatic triacylglycerol lipase
Type:Enzyme
Mol. Mass.:50080.69
Organism:Sus scrofa (Pig)
Description:P00591
Residue:450
BDBM246492
BDBM246504
NameBDBM246492
Synonyms:Batatasin V (10)
TypeSmall organic molecule
Emp. Form.C17H20O4
Mol. Mass.288.3383
SMILESCOc1cc(CCc2ccccc2O)cc(OC)c1OC