Reaction Details
TargetCarbonic anhydrase 1
LigandBDBM246549
Substrate/Competitorn/a
Meas. Tech.Thermal Shift Assay (TSA)
pH7±n/a
Kd 10±n/a nM
Commentsextracted
Citation Zubriene, ACapkauskaite, EGylyte, JKi?onaite, MTumkevicius, SMatulis, D Benzenesulfonamides with benzimidazole moieties as inhibitors of carbonic anhydrases I, II, VII, XII and XIII. J Enzyme Inhib Med Chem29:124-31 (2014) 
 
Carbonic anhydrase 1
Name:Carbonic anhydrase 1
Type:Enzyme
Mol. Mass.:28873.37
Organism:Homo sapiens (Human)
Description:P00915
Residue:261
BDBM246549
NameBDBM246549
Synonyms:4-[(2-Methyl-1H-benzimidazol-1-yl)acetyl]benzenesulfonamide (1b)
TypeSmall organic molecule
Emp. Form.C16H15N3O3S
Mol. Mass.329.374
SMILESCc1nc2ccccc2n1CC(=O)c1ccc(cc1)S(N)(=O)=O