Reaction Details
TargetCarbonic anhydrase 1
LigandBDBM246575
Substrate/Competitorn/a
Meas. Tech.Thermal Shift Assay (TSA)
pH7±n/a
Kd 5000±n/a nM
Commentsextracted
Citation Zubriene, ACapkauskaite, EGylyte, JKi?onaite, MTumkevicius, SMatulis, D Benzenesulfonamides with benzimidazole moieties as inhibitors of carbonic anhydrases I, II, VII, XII and XIII. J Enzyme Inhib Med Chem29:124-31 (2014) 
 
Carbonic anhydrase 1
Name:Carbonic anhydrase 1
Type:Enzyme
Mol. Mass.:28873.37
Organism:Homo sapiens (Human)
Description:P00915
Residue:261
BDBM246575
NameBDBM246575
Synonyms:3-{[2-(Hydroxymethyl)-1H-benzimidazol-1-yl]acetyl}benzenesulfonamide (3c)
TypeSmall organic molecule
Emp. Form.C16H15N3O4S
Mol. Mass.345.373
SMILESNS(=O)(=O)c1cccc(c1)C(=O)Cn1c(CO)nc2ccccc12