Reaction Details
TargetCarbonic anhydrase 1
LigandBDBM246554
Substrate/Competitorn/a
Meas. Tech.Thermal Shift Assay (TSA)
pH7±n/a
Kd 143±n/a nM
Commentsextracted
Citation Zubriene, ACapkauskaite, EGylyte, JKi?onaite, MTumkevicius, SMatulis, D Benzenesulfonamides with benzimidazole moieties as inhibitors of carbonic anhydrases I, II, VII, XII and XIII. J Enzyme Inhib Med Chem29:124-31 (2014) 
 
Carbonic anhydrase 1
Name:Carbonic anhydrase 1
Type:Enzyme
Mol. Mass.:28873.37
Organism:Homo sapiens (Human)
Description:P00915
Residue:261
BDBM246554
NameBDBM246554
Synonyms:4-[(2-Benzyl-1H-benzimidazol-1-yl)acetyl]benzenesulfonamide (1d)
TypeSmall organic molecule
Emp. Form.C22H19N3O3S
Mol. Mass.405.47
SMILESNS(=O)(=O)c1ccc(cc1)C(=O)Cn1c(Cc2ccccc2)nc2ccccc12