Reaction Details
TargetCarbonic anhydrase 2
LigandBDBM246558
Substrate/Competitorn/a
Meas. Tech.Thermal Shift Assay (TSA)
pH7±n/a
Kd 6.25±n/a nM
Commentsextracted
Citation Zubriene, ACapkauskaite, EGylyte, JKi?onaite, MTumkevicius, SMatulis, D Benzenesulfonamides with benzimidazole moieties as inhibitors of carbonic anhydrases I, II, VII, XII and XIII. J Enzyme Inhib Med Chem29:124-31 (2014) 
 
Carbonic anhydrase 2
Name:Carbonic anhydrase 2
Type:Enzyme
Mol. Mass.:29250.71
Organism:Homo sapiens (Human)
Description:P00918
Residue:260
BDBM246558
NameBDBM246558
Synonyms:2-Chloro-4-[(2-ethyl-1H-benzimidazol-1-yl)acetyl]benzenesulfonamide (2e)
TypeSmall organic molecule
Emp. Form.C17H16ClN3O3S
Mol. Mass.377.845
SMILESCCc1nc2ccccc2n1CC(=O)c1ccc(c(Cl)c1)S(N)(=O)=O