Reaction Details
TargetCarbonic anhydrase 2
LigandBDBM246565
Substrate/Competitorn/a
Meas. Tech.Thermal Shift Assay (TSA)
pH7±n/a
Kd 2860±n/a nM
Commentsextracted
Citation Zubriene, ACapkauskaite, EGylyte, JKi?onaite, MTumkevicius, SMatulis, D Benzenesulfonamides with benzimidazole moieties as inhibitors of carbonic anhydrases I, II, VII, XII and XIII. J Enzyme Inhib Med Chem29:124-31 (2014) 
 
Carbonic anhydrase 2
Name:Carbonic anhydrase 2
Type:Enzyme
Mol. Mass.:29250.71
Organism:Homo sapiens (Human)
Description:P00918
Residue:260
BDBM246565
NameBDBM246565
Synonyms:3-[(2-Butyl-1H-benzimidazol-1-yl)acetyl]benzenesulfonamide (3g)
TypeSmall organic molecule
Emp. Form.C19H21N3O3S
Mol. Mass.371.453
SMILESCCCCc1nc2ccccc2n1CC(=O)c1cccc(c1)S(N)(=O)=O