Reaction Details
TargetCarbonic anhydrase 7
LigandBDBM246553
Substrate/Competitorn/a
Meas. Tech.Thermal Shift Assay (TSA)
pH7±n/a
Kd 5±n/a nM
Commentsextracted
Citation Zubriene, ACapkauskaite, EGylyte, JKi?onaite, MTumkevicius, SMatulis, D Benzenesulfonamides with benzimidazole moieties as inhibitors of carbonic anhydrases I, II, VII, XII and XIII. J Enzyme Inhib Med Chem29:124-31 (2014) 
 
Carbonic anhydrase 7
Name:Carbonic anhydrase 7
Type:Enzyme
Mol. Mass.:29664.11
Organism:Homo sapiens (Human)
Description:Human cloned isozyme.
Residue:264
BDBM246553
NameBDBM246553
Synonyms:2-Chloro-4-{[2-(hydroxymethyl)-1H-benzimidazol-1-yl]acetyl}benzenesulfonamide (2c)
TypeSmall organic molecule
Emp. Form.C16H14ClN3O4S
Mol. Mass.379.818
SMILESNS(=O)(=O)c1ccc(cc1Cl)C(=O)Cn1c(CO)nc2ccccc12