Reaction Details
TargetCarbonic anhydrase 7
LigandBDBM246569
Substrate/Competitorn/a
Meas. Tech.Thermal Shift Assay (TSA)
pH7±n/a
Kd 5.56±n/a nM
Commentsextracted
Citation Zubriene, ACapkauskaite, EGylyte, JKi?onaite, MTumkevicius, SMatulis, D Benzenesulfonamides with benzimidazole moieties as inhibitors of carbonic anhydrases I, II, VII, XII and XIII. J Enzyme Inhib Med Chem29:124-31 (2014) 
 
Carbonic anhydrase 7
Name:Carbonic anhydrase 7
Type:Enzyme
Mol. Mass.:29664.11
Organism:Homo sapiens (Human)
Description:Human cloned isozyme.
Residue:264
BDBM246569
NameBDBM246569
Synonyms:4-[(2-Isobutyl-1H-benzimidazol-1-yl)acetyl]benzenesulfonamide (1i)
TypeSmall organic molecule
Emp. Form.C19H21N3O3S
Mol. Mass.371.453
SMILESCC(C)Cc1nc2ccccc2n1CC(=O)c1ccc(cc1)S(N)(=O)=O