Reaction Details
TargetCarbonic anhydrase 12
LigandBDBM246573
Substrate/Competitorn/a
Meas. Tech.Thermal Shift Assay (TSA)
pH7±n/a
Kd 66.7±n/a nM
Commentsextracted
Citation Zubriene, ACapkauskaite, EGylyte, JKi?onaite, MTumkevicius, SMatulis, D Benzenesulfonamides with benzimidazole moieties as inhibitors of carbonic anhydrases I, II, VII, XII and XIII. J Enzyme Inhib Med Chem29:124-31 (2014) 
 
Carbonic anhydrase 12
Name:Carbonic anhydrase 12
Type:Enzyme
Mol. Mass.:39456.00
Organism:Homo sapiens (Human)
Description:Catalytic domain of human cloned isozyme was used in the assay
Residue:354
BDBM246573
NameBDBM246573
Synonyms:2-Chloro-4-{[2-(methylthio)-1H-benzimidazol-1-yl]acetyl}-benzenesulfonamide (2j)
TypeSmall organic molecule
Emp. Form.C16H14ClN3O3S2
Mol. Mass.395.884
SMILESCSc1nc2ccccc2n1CC(=O)c1ccc(c(Cl)c1)S(N)(=O)=O