Reaction Details
TargetCarbonic anhydrase 13
LigandBDBM50163864
Substrate/Competitorn/a
Meas. Tech.Thermal Shift Assay (TSA)
pH7±n/a
Kd 2380±n/a nM
Commentsextracted
Citation Zubriene, ACapkauskaite, EGylyte, JKi?onaite, MTumkevicius, SMatulis, D Benzenesulfonamides with benzimidazole moieties as inhibitors of carbonic anhydrases I, II, VII, XII and XIII. J Enzyme Inhib Med Chem29:124-31 (2014) 
 
Carbonic anhydrase 13
Name:Carbonic anhydrase 13
Type:Enzyme
Mol. Mass.:29445.78
Organism:Homo sapiens (Human)
Description:Q8N1Q1
Residue:262
BDBM50163864
NameBDBM50163864
Synonyms:3-(1H-benzimidazol-1-ylacetyl)benzenesulfonamide (3a) carbonic anhydrase (CA) inhibitors, benzenesulphonamide ligand, 3
TypeSmall organic molecule
Emp. Form.C15H13N3O3S
Mol. Mass.315.347
SMILESNS(=O)(=O)c1cccc(c1)C(=O)Cn1cnc2ccccc12