Reaction Details
TargetCarbonic anhydrase 13
LigandBDBM246561
Substrate/Competitorn/a
Meas. Tech.Thermal Shift Assay (TSA)
pH7±n/a
Kd 5.56±n/a nM
Commentsextracted
Citation Zubriene, ACapkauskaite, EGylyte, JKi?onaite, MTumkevicius, SMatulis, D Benzenesulfonamides with benzimidazole moieties as inhibitors of carbonic anhydrases I, II, VII, XII and XIII. J Enzyme Inhib Med Chem29:124-31 (2014) 
 
Carbonic anhydrase 13
Name:Carbonic anhydrase 13
Type:Enzyme
Mol. Mass.:29445.78
Organism:Homo sapiens (Human)
Description:Q8N1Q1
Residue:262
BDBM246561
NameBDBM246561
Synonyms:2-Chloro-4-[(2-propyl-1H-benzimidazol-1-yl)acetyl]benzenesulfonamide (2f)
TypeSmall organic molecule
Emp. Form.C18H18ClN3O3S
Mol. Mass.391.872
SMILESCCCc1nc2ccccc2n1CC(=O)c1ccc(c(Cl)c1)S(N)(=O)=O