Reaction Details
TargetCarbonic anhydrase 13
LigandBDBM246564
Substrate/Competitorn/a
Meas. Tech.Thermal Shift Assay (TSA)
pH7±n/a
Kd 2.5±n/a nM
Commentsextracted
Citation Zubriene, ACapkauskaite, EGylyte, JKi?onaite, MTumkevicius, SMatulis, D Benzenesulfonamides with benzimidazole moieties as inhibitors of carbonic anhydrases I, II, VII, XII and XIII. J Enzyme Inhib Med Chem29:124-31 (2014) 
 
Carbonic anhydrase 13
Name:Carbonic anhydrase 13
Type:Enzyme
Mol. Mass.:29445.78
Organism:Homo sapiens (Human)
Description:Q8N1Q1
Residue:262
BDBM246564
NameBDBM246564
Synonyms:4-[(2-Butyl-1H-benzimidazol-1-yl)acetyl]-2-chlorobenzenesulfonamide (2g)
TypeSmall organic molecule
Emp. Form.C19H20ClN3O3S
Mol. Mass.405.898
SMILESCCCCc1nc2ccccc2n1CC(=O)c1ccc(c(Cl)c1)S(N)(=O)=O