Reaction Details
TargetIsocitrate dehydrogenase [NADP] cytoplasmic
LigandBDBM247614
Substrate/Competitorn/a
Meas. Tech.Fluorescence Biochemical Assay
pH7.5±n/a
Temperature298.15±n/a K
IC50 4±n/a nM
Commentsextracted
Citation Caferro, TRChen, ZCho, YSCostales, AQLevell, JRLiu, GManning, JRSendzik, MShafer, CShultz, MDSutton, JWang, YZhao, Q 3-pyrimidin-4-yl-oxazolidin-2-ones as inhibitors of mutant IDH US Patent US9434719 Publication Date 9/6/2016
 
Isocitrate dehydrogenase [NADP] cytoplasmic
Name:Isocitrate dehydrogenase [NADP] cytoplasmic
Type:Protein
Mol. Mass.:46661.29
Organism:Homo sapiens (Human)
Description:O75874
Residue:414
BDBM247614
NameBDBM247614
Synonyms:US10112931, Example 216 US9688672, Example 216
TypeSmall organic molecule
Emp. Form.C20H19Cl2N5O3S
Mol. Mass.480.368
SMILESC[C@@H](O)[C@H]1COC(=O)N1c1cc(Cl)nc(N[C@@H](C)c2cnc(s2)-c2ccc(Cl)cc2)n1