Reaction Details
TargetIsocitrate dehydrogenase [NADP] cytoplasmic
LigandBDBM247494
Substrate/Competitorn/a
Meas. Tech.LC-MS Detection of 2-HG Assay
pH7.4±n/a
Temperature298.15±n/a K
IC50 5±n/a nM
Commentsextracted
Citation Caferro, TRChen, ZCho, YSCostales, AQLevell, JRLiu, GManning, JRSendzik, MShafer, CShultz, MDSutton, JWang, YZhao, Q 3-pyrimidin-4-yl-oxazolidin-2-ones as inhibitors of mutant IDH US Patent US9434719 Publication Date 9/6/2016
 
Isocitrate dehydrogenase [NADP] cytoplasmic
Name:Isocitrate dehydrogenase [NADP] cytoplasmic
Type:Protein
Mol. Mass.:46661.29
Organism:Homo sapiens (Human)
Description:O75874
Residue:414
BDBM247494
NameBDBM247494
Synonyms:US9434719, 28
TypeSmall organic molecule
Emp. Form.C23H26ClF4N5O4
Mol. Mass.547.93
SMILESCC(O)[C@H]1COC(=O)N1c1nc(N[C@@H](C)C2CCN(CC2)c2ccc(Cl)c(OC(F)(F)F)c2)ncc1F