Reaction Details
TargetVoltage-dependent N-type calcium channel subunit alpha-1B
LigandBDBM247259
Substrate/Competitorn/a
Meas. Tech.Patch Clamp/Inhibition Assay
Ki 700±n/a nM
Citation Pevarello, P Fluorinated arylalkylaminocarboxamide derivatives US Patent US9447029 Publication Date 9/20/2016
 
Voltage-dependent N-type calcium channel subunit alpha-1B
Name:Voltage-dependent N-type calcium channel subunit alpha-1B
Type:Enzyme
Mol. Mass.:262548.16
Organism:Homo sapiens (Human)
Description:Q00975
Residue:2339
BDBM247259
NameBDBM247259
Synonyms:US9447029, 1-29
TypeSmall organic molecule
Emp. Form.C19H28F2N2O2
Mol. Mass.354.4346
SMILESCCCCOc1cccc(c1)C(F)(F)CNCC(=O)N1CCCCC1