Reaction Details
TargetCoagulation factor XI
LigandBDBM247411
Substrate/CompetitorUS9453018, pyroGlu-Pro-Arg-pNA
Meas. Tech.In Vitro Assay
pH7.4±n/a
Temperature310.15±n/a K
Ki 0.1±n/a nM
Citation Dilger, AKCorte, JRDe Lucca, IFang, TYang, WWang, YPabbisetty, KBEwing, WRZhu, YWexler, RRPinto, DJOrwat, MJSmith, II, LM Pyrimidinones as factor XIa inhibitors US Patent US9453018 Publication Date 9/27/2016
 
Coagulation factor XI
Name:Coagulation factor XI
Type:Enzyme
Mol. Mass.:70130.58
Organism:Homo sapiens (Human)
Description:P03951
Residue:625
BDBM247411
US9453018, pyroGlu-Pro-Arg-pNA
NameBDBM247411
Synonyms:US10336754, Example 353 US9453018, 353
TypeSmall organic molecule
Emp. Form.C28H23Cl2F2N9O2
Mol. Mass.626.444
SMILESC[C@@H]1CCC[C@@H](c2cc(ccn2)-c2c(NC1=O)cnn2C(F)F)n1cnc(cc1=O)-c1cc(Cl)ccc1-n1cc(Cl)nn1