Reaction Details
TargetCarbonic anhydrase 12
LigandBDBM248142
Substrate/Competitorn/a
Meas. Tech.CA Inhibition Assay
pH7.5±n/a
Temperature298.15±n/a K
Ki 2.15e+3±n/a nM
Commentsextracted
Citation Durdagi, SScozzafava, GVullo, DSahin, HKolayli, SSupuran, CT Inhibition of mammalian carbonic anhydrases I-XIV with grayanotoxin III: solution and in silico studies. J Enzyme Inhib Med Chem29:469-75 (2014) 
 
Carbonic anhydrase 12
Name:Carbonic anhydrase 12
Type:Enzyme
Mol. Mass.:39456.00
Organism:Homo sapiens (Human)
Description:Catalytic domain of human cloned isozyme was used in the assay
Residue:354
BDBM248142
NameBDBM248142
Synonyms:Grayanotoxin III (GTX3)
TypeSmall organic molecule
Emp. Form.C20H34O6
Mol. Mass.370.4804
SMILESC[C@@]1(O)CC23C[C@@H](O)[C@@]4(O)[C@@H](C[C@H](O)C4(C)C)[C@](C)(O)[C@@H]2CCC1[C@H]3O