Reaction Details
TargetSecreted chorismate mutase
LigandBDBM248165
Substrate/Competitorn/a
Meas. Tech.CM Assay
pH7.5±0
Temperature310.15±0 K
IC50 1.16e+4± 8e+2 nM
Citation Alokam, RJeankumar, VUSridevi, JPMatikonda, SSPeddi, SAlvala, MYogeeswari, PSriram, D Identification and structure-activity relationship study of carvacrol derivatives as Mycobacterium tuberculosis chorismate mutase inhibitors. J Enzyme Inhib Med Chem29:547-54 (2014) 
 
Secreted chorismate mutase
Name:Secreted chorismate mutase
Type:Protein
Mol. Mass.:21942.03
Organism:Mycobacterium tuberculosis H37Rv
Description:n/a
Residue:199
BDBM248165
NameBDBM248165
Synonyms:Carvacrol derivative, 8
TypeSmall organic molecule
Emp. Form.C10H14
Mol. Mass.134.2182
SMILESCC(C)c1ccc(C)cc1