Reaction Details
TargetSerine/threonine-protein kinase pim-3
LigandBDBM248959
Substrate/Competitorn/a
Meas. Tech.Kinase Binding Assay
pH7.2±n/a
Temperature298.15±n/a K
Ki 0.023±n/a nM
Commentsextracted
Citation Do, SHu, HKolesnikov, ATsui, VHWang, X 5-azaindazole compounds and methods of use US Patent US9434725 Publication Date 9/6/2016
 
Serine/threonine-protein kinase pim-3
Name:Serine/threonine-protein kinase pim-3
Type:Protein
Mol. Mass.:35888.19
Organism:Homo sapiens (Human)
Description:Q86V86
Residue:326
BDBM248959
NameBDBM248959
Synonyms:US9434725, 190
TypeSmall organic molecule
Emp. Form.C21H22N8
Mol. Mass.386.453
SMILESCc1cncc(n1)-c1cc2n(ncc2cn1)-c1cccc(NC2CCNCC2)n1