Reaction Details
TargetSerine/threonine-protein kinase pim-3
LigandBDBM248964
Substrate/Competitorn/a
Meas. Tech.Kinase Binding Assay
pH7.2±n/a
Temperature298.15±n/a K
Ki 0.025±n/a nM
Commentsextracted
Citation Do, SHu, HKolesnikov, ATsui, VHWang, X 5-azaindazole compounds and methods of use US Patent US9434725 Publication Date 9/6/2016
 
Serine/threonine-protein kinase pim-3
Name:Serine/threonine-protein kinase pim-3
Type:Protein
Mol. Mass.:35888.19
Organism:Homo sapiens (Human)
Description:Q86V86
Residue:326
BDBM248964
NameBDBM248964
Synonyms:US9434725, 195 US9434725, 204
TypeSmall organic molecule
Emp. Form.C22H24N8
Mol. Mass.400.4796
SMILESCC1C(N)CCCN1c1cccc(n1)-n1ncc2cnc(cc12)-c1cncc(C)n1