Reaction Details
TargetBeta-secretase 2
LigandBDBM249121
Substrate/Competitorn/a
Meas. Tech.Time-Resolved Endpoint Proteolysis Assay
pH5±n/a
Temperature303.15±n/a K
Ki 0.6±n/a nM
Commentsextracted
Citation Gilbert, EJCumming, JNScott, JDWu, WBurnett, DAStamford, AW C2-azaspiro iminothiazine dioxides as BACE inhibitors, compositions, and their use US Patent US9453034 Publication Date 9/27/2016
 
Beta-secretase 2
Name:Beta-secretase 2
Type:Protein
Mol. Mass.:56171.20
Organism:Homo sapiens (Human)
Description:Q9Y5Z0
Residue:518
BDBM249121
NameBDBM249121
Synonyms:US9453034, 40
TypeSmall organic molecule
Emp. Form.C27H28FN5O4S
Mol. Mass.537.606
SMILESCOc1ccc(nc1)C(=O)Nc1ccc(F)c(c1)[C@]1(C)CS(=O)(=O)C2(CN(Cc3ccccc3)C2)C(=N)N1