Reaction Details
TargetBeta-secretase 2
LigandBDBM249123
Substrate/Competitorn/a
Meas. Tech.Time-Resolved Endpoint Proteolysis Assay
pH5±n/a
Temperature303.15±n/a K
Ki 0.32±n/a nM
Commentsextracted
Citation Gilbert, EJCumming, JNScott, JDWu, WBurnett, DAStamford, AW C2-azaspiro iminothiazine dioxides as BACE inhibitors, compositions, and their use US Patent US9453034 Publication Date 9/27/2016
 
Beta-secretase 2
Name:Beta-secretase 2
Type:Protein
Mol. Mass.:56171.20
Organism:Homo sapiens (Human)
Description:Q9Y5Z0
Residue:518
BDBM249123
NameBDBM249123
Synonyms:US9453034, 42
TypeSmall organic molecule
Emp. Form.C26H25FN6O6S
Mol. Mass.568.577
SMILESCOc1ccc(nc1)C(=O)Nc1ccc(F)c(c1)[C@]1(C)CS(=O)(=O)C2(CN(C2)c2ccc(cc2)[N+]([O-])=O)C(=N)N1