Reaction Details
TargetBromodomain-containing protein 4 [75-147]
LigandBDBM249288
Substrate/Competitorn/a
Meas. Tech.Amplified Luminescent Proximity Homogeneous Assay (ALPHA)
pH7.5±n/a
Temperature298.15±n/a K
IC50 25.1±n/a nM
Commentsextracted
Citation Aktoudianakis, EChin, GCorkey, BKDu, JElbel, KJiang, RHKobayashi, TLee, RMartinez, RMetobo, SEMish, MMunoz, MShevick, SSperandio, DYang, HZablocki, J Benzimidazole derivatives as bromodomain inhibitors US Patent US9458145 Publication Date 10/4/2016
 
Bromodomain-containing protein 4 [75-147]
Name:Bromodomain-containing protein 4 [75-147]
Type:n/a
Mol. Mass.:8856.55
Organism:Homo sapiens (Human)
Description:BD1 (75-147 aa) of O60885
Residue:73
BDBM249288
NameBDBM249288
Synonyms:US10017501, Compound 1020-78 | US9458145, 1020-78
TypeSmall organic molecule
Emp. Form.C20H19F2N5O
Mol. Mass.383.3946
SMILESCc1n[nH]c(C)c1-c1cc(cc2nc([nH]c12)C1CC1(F)F)-c1c(C)noc1C