Reaction Details
TargetBromodomain-containing protein 4 [75-147]
LigandBDBM249307
Substrate/Competitorn/a
Meas. Tech.Ligand KI Assay
pH7.5±n/a
Temperature298.15±n/a K
IC50 10.4±n/a nM
Commentsextracted
Citation Aktoudianakis, EChin, GCorkey, BKDu, JElbel, KJiang, RHKobayashi, TLee, RMartinez, RMetobo, SEMish, MMunoz, MShevick, SSperandio, DYang, HZablocki, J Benzimidazole derivatives as bromodomain inhibitors US Patent US9458145 Publication Date 10/4/2016
 
Bromodomain-containing protein 4 [75-147]
Name:Bromodomain-containing protein 4 [75-147]
Type:n/a
Mol. Mass.:8856.55
Organism:Homo sapiens (Human)
Description:BD1 (75-147 aa) of O60885
Residue:73
BDBM249307
NameBDBM249307
Synonyms:US10017501, Compound 1020-112 | US9458145, 1020-112
TypeSmall organic molecule
Emp. Form.C27H24N4O2
Mol. Mass.436.5051
SMILESCc1noc(C)c1-c1cc(c2nc([nH]c2c1)C1CC1)C(O)(c1ccccc1)c1cccnc1