Reaction Details
TargetBromodomain-containing protein 4 [368-440]
LigandBDBM249312
Substrate/Competitorn/a
Meas. Tech.Ligand KI Assay
pH7.5±n/a
Temperature298.15±n/a K
IC50 5.6±n/a nM
Commentsextracted
Citation Aktoudianakis, EChin, GCorkey, BKDu, JElbel, KJiang, RHKobayashi, TLee, RMartinez, RMetobo, SEMish, MMunoz, MShevick, SSperandio, DYang, HZablocki, J Benzimidazole derivatives as bromodomain inhibitors US Patent US9458145 Publication Date 10/4/2016
 
Bromodomain-containing protein 4 [368-440]
Name:Bromodomain-containing protein 4 [368-440]
Type:Protein
Mol. Mass.:8564.63
Organism:Homo sapiens (Human)
Description:BD2 (368-440 aa) of O60885
Residue:73
BDBM249312
NameBDBM249312
Synonyms:US10017501, Compound 1020-257 | US9458145, 1020-257
TypeSmall organic molecule
Emp. Form.C26H21F2N5O2
Mol. Mass.473.474
SMILESCc1noc(C)c1-c1cc(c2nc([nH]c2c1)C1CC1)C(O)(c1ncccn1)c1ccc(F)cc1F