Reaction Details
TargetBromodomain-containing protein 4 [368-440]
LigandBDBM249313
Substrate/Competitorn/a
Meas. Tech.Ligand KI Assay
pH7.5±n/a
Temperature298.15±n/a K
IC50 2.0±n/a nM
Commentsextracted
Citation Aktoudianakis, EChin, GCorkey, BKDu, JElbel, KJiang, RHKobayashi, TLee, RMartinez, RMetobo, SEMish, MMunoz, MShevick, SSperandio, DYang, HZablocki, J Benzimidazole derivatives as bromodomain inhibitors US Patent US9458145 Publication Date 10/4/2016
 
Bromodomain-containing protein 4 [368-440]
Name:Bromodomain-containing protein 4 [368-440]
Type:Protein
Mol. Mass.:8564.63
Organism:Homo sapiens (Human)
Description:BD2 (368-440 aa) of O60885
Residue:73
BDBM249313
NameBDBM249313
Synonyms:US9458145, 1020-289
TypeSmall organic molecule
Emp. Form.C24H25N5O3
Mol. Mass.431.487
SMILESCc1noc(C)c1-c1cc(c2nc([nH]c2c1)C1CC1)C(O)(C1CCCO1)c1cccnn1